Target
Tyrosine-protein kinase SYK
Ligand
BDBM50396073
Substrate
Meas. Tech.
ChEMBL_772965 (CHEMBL1838853)
IC50
6.3±n/a nM
Citation
 Liddle, JAtkinson, FLBarker, MDCarter, PSCurtis, NRDavis, RPDouault, CDickson, MCElwes, DGarton, NSGray, MHayhow, TGHobbs, CIJones, ELeach, SLeavens, KLewis, HDMcCleary, SNeu, MPatel, VKPreston, AGRamirez-Molina, CShipley, TJSkone, PASmithers, NSomers, DOWalker, ALWatson, RJWeingarten, GG Discovery of GSK143, a highly potent, selective and orally efficacious spleen tyrosine kinase inhibitor. Bioorg Med Chem Lett 21:6188-94 (2011)  
Target
Name:
Tyrosine-protein kinase SYK
Synonyms:
KSYK_HUMAN Spleen Tyrosine Kinase Tyrosine-protein kinase SYK (Syk)
Type:
Enzyme
Mol. Mass.:
72079.99
Organism:
Homo sapiens (Human)
Description:
P43405
Residue:
635
  
Inhibitor
Name:
BDBM50396073
Synonyms:
CHEMBL1235110
Type:
Small organic molecule
Emp. Form.:
C18H24N6O
Mol. Mass.:
340.4228
SMILES:
Cc1cccc(Nc2nc(N[C@@H]3CCCC[C@@H]3N)ncc2C(N)=O)c1
: