Target
Muscarinic acetylcholine receptor M3
Ligand
BDBM50419504
Substrate
Meas. Tech.
ChEMBL_789189 (CHEMBL1924273)
IC50
0.0631±n/a nM
Citation
 Mete, ABowers, KChevalier, EDonald, DKEdwards, HEscott, KJFord, RGrime, KMillichip, ITeobald, BRussell, V The discovery of AZD9164, a novel muscarinic M3 antagonist. Bioorg Med Chem Lett 21:7440-6 (2011)  
Target
Name:
Muscarinic acetylcholine receptor M3
Synonyms:
ACM3_HUMAN Cholinergic, muscarinic M3 Muscarinic receptor M3 | RecName: Full=Muscarinic acetylcholine receptor M3
Type:
Enzyme
Mol. Mass.:
66151.03
Organism:
Homo sapiens (Human)
Description:
P20309
Residue:
590
  
Inhibitor
Name:
BDBM50419504
Synonyms:
CHEMBL1921907
Type:
Small organic molecule
Emp. Form.:
C29H38BrN2O2
Mol. Mass.:
526.528
SMILES:
C[C@@](N1CCCCC1)(C(=O)O[C@H]1C[N+]2(CCc3cccc(Br)c3)CCC1CC2)c1ccccc1
: