Target
Muscarinic acetylcholine receptor M3
Ligand
BDBM50419521
Substrate
Meas. Tech.
ChEMBL_789189 (CHEMBL1924273)
IC50
0.251±n/a nM
Citation
 Mete, ABowers, KChevalier, EDonald, DKEdwards, HEscott, KJFord, RGrime, KMillichip, ITeobald, BRussell, V The discovery of AZD9164, a novel muscarinic M3 antagonist. Bioorg Med Chem Lett 21:7440-6 (2011)  
Target
Name:
Muscarinic acetylcholine receptor M3
Synonyms:
ACM3_HUMAN Cholinergic, muscarinic M3 Muscarinic receptor M3 | RecName: Full=Muscarinic acetylcholine receptor M3
Type:
Enzyme
Mol. Mass.:
66151.03
Organism:
Homo sapiens (Human)
Description:
P20309
Residue:
590
  
Inhibitor
Name:
BDBM50419521
Synonyms:
CHEMBL1924029
Type:
Small organic molecule
Emp. Form.:
C21H33N2O2
Mol. Mass.:
345.4984
SMILES:
CC(N1CCCCC1)(C(=O)OC1CC[N+](C)(C)CC1)c1ccccc1
: