Target
Acetylcholine-binding protein
Ligand
BDBM50419746
Substrate
Meas. Tech.
ChEMBL_801486 (CHEMBL1948413)
Ki
100±n/a nM
Citation
 Edink, EAkdemir, AJansen, Cvan Elk, RZuiderveld, Ode Kanter, FJvan Muijlwijk-Koezen, JESmit, ABLeurs, Rde Esch, IJ Structure-based design, synthesis and structure-activity relationships of dibenzosuberyl- and benzoate-substituted tropines as ligands for acetylcholine-binding protein. Bioorg Med Chem Lett 22:1448-54 (2012)  
Target
Name:
Acetylcholine-binding protein
Synonyms:
ACHP_LYMST Acetylcholine Binding protein Acetylcholine-binding protein (Ls-AchBP) | AchBP
Type:
Mol. Mass.:
26055.52
Organism:
Lymnaea stagnalis
Description:
Soluble acetylcholine receptor
Residue:
229
  
Inhibitor
Name:
BDBM50419746
Synonyms:
CHEMBL1946188
Type:
Small organic molecule
Emp. Form.:
C30H33NO
Mol. Mass.:
423.5891
SMILES:
C(Cc1ccccc1)N1[C@H]2CC[C@@H]1C[C@@H](C2)OC1c2ccccc2CCc2ccccc12
: