Target
Acetylcholine-binding protein
Ligand
BDBM50419750
Substrate
Meas. Tech.
ChEMBL_801486 (CHEMBL1948413)
Ki
125.89±n/a nM
Citation
 Edink, EAkdemir, AJansen, Cvan Elk, RZuiderveld, Ode Kanter, FJvan Muijlwijk-Koezen, JESmit, ABLeurs, Rde Esch, IJ Structure-based design, synthesis and structure-activity relationships of dibenzosuberyl- and benzoate-substituted tropines as ligands for acetylcholine-binding protein. Bioorg Med Chem Lett 22:1448-54 (2012)  
Target
Name:
Acetylcholine-binding protein
Synonyms:
ACHP_LYMST Acetylcholine Binding protein Acetylcholine-binding protein (Ls-AchBP) | AchBP
Type:
Mol. Mass.:
26055.52
Organism:
Lymnaea stagnalis
Description:
Soluble acetylcholine receptor
Residue:
229
  
Inhibitor
Name:
BDBM50419750
Synonyms:
CHEMBL1947060
Type:
Small organic molecule
Emp. Form.:
C23H28NO3
Mol. Mass.:
366.4728
SMILES:
C[N+]1(C[C@H](O)c2ccccc2)[C@H]2CC[C@@H]1C[C@@H](C2)OC(=O)c1ccccc1
: