Target
Soluble acetylcholine receptor
Ligand
BDBM50419745
Substrate
Meas. Tech.
ChEMBL_801487 (CHEMBL1948414)
Ki
10000±n/a nM
Citation
 Edink, EAkdemir, AJansen, Cvan Elk, RZuiderveld, Ode Kanter, FJvan Muijlwijk-Koezen, JESmit, ABLeurs, Rde Esch, IJ Structure-based design, synthesis and structure-activity relationships of dibenzosuberyl- and benzoate-substituted tropines as ligands for acetylcholine-binding protein. Bioorg Med Chem Lett 22:1448-54 (2012)  
Target
Name:
Soluble acetylcholine receptor
Synonyms:
Acetylcholine Binding protein | Soluble acetylcholine receptor
Type:
Mol. Mass.:
26560.08
Organism:
Aplysia Californica
Description:
Q8WSF8
Residue:
236
  
Inhibitor
Name:
BDBM50419745
Synonyms:
CHEMBL1794606
Type:
Small organic molecule
Emp. Form.:
C29H31NO
Mol. Mass.:
409.5625
SMILES:
C(N1[C@H]2CC[C@@H]1C[C@@H](C2)OC1c2ccccc2CCc2ccccc12)c1ccccc1
: