Target
Beta-secretase 1
Ligand
BDBM50419857
Substrate
Meas. Tech.
ChEMBL_807805 (CHEMBL1959583)
IC50
35±n/a nM
Citation
 Swahn, BMHolenz, JKihlström, JKolmodin, KLindström, JPlobeck, NRotticci, DSehgelmeble, FSundström, MBerg, SvFälting, JGeorgievska, BGustavsson, SNeelissen, JEk, MOlsson, LLBerg, S Aminoimidazoles as BACE-1 inhibitors: the challenge to achieve in vivo brain efficacy. Bioorg Med Chem Lett 22:1854-9 (2012)  
Target
Name:
Beta-secretase 1
Synonyms:
ASP2 Aspartyl protease 2 BACE1 Beta-secretase (BACE) Beta-secretase 1 (BACE 1) Beta-secretase 1 (BACE1) Beta-site amyloid precursor protein cleaving enzyme 1 Memapsin-2 beta-Secretase (BACE-1) | beta-Secretase (BACE1)
Type:
Protein
Mol. Mass.:
55755.10
Organism:
Homo sapiens (Human)
Description:
P56817
Residue:
501
  
Inhibitor
Name:
BDBM50419857
Synonyms:
CHEMBL1957480
Type:
Small organic molecule
Emp. Form.:
C23H20F4N4O2
Mol. Mass.:
460.4241
SMILES:
COCC#Cc1cccc(c1)C1(N=C(N)N2CC(F)(F)CN=C12)c1ccc(OC(F)F)cc1
: