Target
B2 bradykinin receptor
Ligand
BDBM50419900
Substrate
Meas. Tech.
ChEMBL_806221 (CHEMBL1958762)
Ki
0.126±n/a nM
Citation
 Fincham, CIBressan, AD'Andrea, PEttorre, AGiuliani, SMauro, SMeini, SParis, MQuartara, LRossi, CSquarcia, AValenti, CDaniela, FMaggi, CA Design and synthesis of novel sulfonamide-containing bradykinin hB(2) receptor antagonists. Synthesis and structure-relationships ofa,a-tetrahydropyranylglycine. Bioorg Med Chem 20:2091-100 (2012)  
Target
Name:
B2 bradykinin receptor
Synonyms:
B2 BRADYKININ B2R BK-2 receptor BKRB2_HUMAN | Bradykinin B2 receptor
Type:
Enzyme Catalytic Domain
Mol. Mass.:
44467.17
Organism:
Homo sapiens (Human)
Description:
B2 BRADYKININ BDKRB2 HUMAN::P30411
Residue:
391
  
Inhibitor
Name:
BDBM50419900
Synonyms:
CHEMBL1956718
Type:
Small organic molecule
Emp. Form.:
C34H44Cl2N8O6S
Mol. Mass.:
763.734
SMILES:
[#6]-c1cc(-[#6])c2cccc(-[#8]-[#6]-c3c(Cl)ccc(c3Cl)S(=O)(=O)[#7]C3([#6]-[#6]-[#8]-[#6]-[#6]3)[#6](=O)-[#7]-3-[#6]-[#6]-[#7](-[#6]-[#6]-3)-[#6](=O)-[#6@@H](-[#7])-[#6]-[#6]-[#6]\[#7]=[#6](\[#7])-[#7])c2n1
: