Target
B2 bradykinin receptor
Ligand
BDBM50419902
Substrate
Meas. Tech.
ChEMBL_806231 (CHEMBL1958772)
Kd
0.0631±n/a nM
Citation
 Fincham, CIBressan, AD'Andrea, PEttorre, AGiuliani, SMauro, SMeini, SParis, MQuartara, LRossi, CSquarcia, AValenti, CDaniela, FMaggi, CA Design and synthesis of novel sulfonamide-containing bradykinin hB(2) receptor antagonists. Synthesis and structure-relationships ofa,a-tetrahydropyranylglycine. Bioorg Med Chem 20:2091-100 (2012)  
Target
Name:
B2 bradykinin receptor
Synonyms:
B2 bradykinin receptor BDKRB2 BKRB2_CAVPO | Bradykinin B2 receptor
Type:
Mol. Mass.:
42217.03
Organism:
Cavia porcellus
Description:
Residue:
372
  
Inhibitor
Name:
BDBM50419902
Synonyms:
CHEMBL1956722
Type:
Small organic molecule
Emp. Form.:
C36H48Cl2N5O6S
Mol. Mass.:
749.767
SMILES:
Cc1cc(C)c2cccc(OCc3c(Cl)ccc(c3Cl)S(=O)(=O)NC3(CCOCC3)C(=O)N3CCN(CC3)C(=O)CCCC[N+](C)(C)C)c2n1
: