Target
cAMP and cAMP-inhibited cGMP 3',5'-cyclic phosphodiesterase 10A
Ligand
BDBM50390137
Substrate
Meas. Tech.
ChEMBL_834527 (CHEMBL2073576)
IC50
0.800±n/a nM
Citation
 Cutshall, NSOnrust, RRohde, AGragerov, SHamilton, LHarbol, KShen, HRMcKee, SZuta, CGragerova, GFlorio, VWheeler, TNGage, JL Novel 2-methoxyacylhydrazones as potent, selective PDE10A inhibitors with activity in animal models of schizophrenia. Bioorg Med Chem Lett 22:5595-9 (2012)  
Target
Name:
cAMP and cAMP-inhibited cGMP 3',5'-cyclic phosphodiesterase 10A
Synonyms:
PDE10_MOUSE | Pde10a
Type:
PROTEIN
Mol. Mass.:
89407.64
Organism:
Mus musculus
Description:
ChEMBL_1458264
Residue:
790
  
Inhibitor
Name:
BDBM50390137
Synonyms:
CHEMBL2069694
Type:
Small organic molecule
Emp. Form.:
C21H21BrN4O4
Mol. Mass.:
473.32
SMILES:
COC(C(=O)N\N=C\c1cc(OC)c(Br)c(OC)c1)c1ccc(cc1)-n1cccn1
: