Target
Solute carrier organic anion transporter family member 1A4
Ligand
BDBM50009859
Substrate
Meas. Tech.
ChEMBL_836632 (CHEMBL2077474)
Ki
2430000±n/a nM
Citation
 Shitara, YSugiyama, DKusuhara, HKato, YAbe, TMeier, PJItoh, TSugiyama, Y Comparative inhibitory effects of different compounds on rat oatpl (slc21a1)- and Oatp2 (Slc21a5)-mediated transport. Pharm Res 19:147-53 (2002)  
Target
Name:
Solute carrier organic anion transporter family member 1A4
Synonyms:
Brain digoxin carrier protein OATP-B1 Oatp2 Slc21a5 Sodium-independent organic anion-transporting polypeptide 2 | Solute carrier family 21 member 5
Type:
PROTEIN
Mol. Mass.:
73261.82
Organism:
Rattus norvegicus
Description:
ChEMBL_836631
Residue:
661
  
Inhibitor
Name:
BDBM50009859
Synonyms:
(+-)-2-(p-isobutylphenyl)propionic acid (+-)-ibuprofen (4-isobutylphenyl)-alpha-methylacetic acid 2-(4-isobutylphenyl)propanoic acid 4-isobutylhydratropic acid Brufen IBUPROFEN LYSINE Ibuprofen (1) alpha-(4-isobutylphenyl)propionic acid | alpha-(p-isobutylphenyl)propionic acid
Type:
Small organic molecule
Emp. Form.:
C13H18O2
Mol. Mass.:
206.2808
SMILES:
CC(C)Cc1ccc(cc1)C(C)C(O)=O
: