Target
Solute carrier family 22 member 6
Ligand
BDBM50344967
Substrate
Meas. Tech.
ChEMBL_836287 (CHEMBL2076300)
Ki
9200±n/a nM
Citation
 Uwai, YSaito, HHashimoto, YInui, K Inhibitory effect of anti-diabetic agents on rat organic anion transporter rOAT1. Eur J Pharmacol 398:193-7 (2000)  
Target
Name:
Solute carrier family 22 member 6
Synonyms:
Oat1 S22A6_RAT rOAT1 renal organic anion transporter 1
Type:
PROTEIN
Mol. Mass.:
60784.17
Organism:
Rattus norvegicus
Description:
ChEMBL_838479
Residue:
551
  
Inhibitor
Name:
BDBM50344967
Synonyms:
2-[(4-Isopropyl-cyclohexanecarbonyl)-amino]-3-phenyl-propionic acid AY-4166 DJN-608 SDZ-DJN-608 | Starlix
Type:
Small organic molecule
Emp. Form.:
C19H27NO3
Mol. Mass.:
317.4226
SMILES:
CC(C)[C@H]1CC[C@@H](CC1)C(=O)N[C@H](Cc1ccccc1)C(O)=O
: