Target
Solute carrier family 22 member 6
Ligand
BDBM50420185
Substrate
Meas. Tech.
ChEMBL_836508 (CHEMBL2077038)
Ki
23000±n/a nM
Citation
 Enomoto, ATakeda, MTaki, KTakayama, FNoshiro, RNiwa, TEndou, H Interactions of human organic anion as well as cation transporters with indoxyl sulfate. Eur J Pharmacol 466:13-20 (2003)  
Target
Name:
Solute carrier family 22 member 6
Synonyms:
OAT1 PAH transporter Renal organic anion transporter 1 SLC22A6 hPAHT | hROAT1
Type:
PROTEIN
Mol. Mass.:
61831.78
Organism:
Homo sapiens (Human)
Description:
ChEMBL_1487359
Residue:
563
  
Inhibitor
Name:
BDBM50420185
Synonyms:
CHEMBL1233636
Type:
Small organic molecule
Emp. Form.:
C8H7NO4S
Mol. Mass.:
213.21
SMILES:
OS(=O)(=O)Oc1c[nH]c2ccccc12
: