Target
Solute carrier organic anion transporter family member 1A3
Ligand
BDBM286
Substrate
Meas. Tech.
ChEMBL_838743 (CHEMBL2078569)
Ki
8200±n/a nM
Citation
 Takeuchi, AMasuda, SSaito, HHashimoto, YInui, K Trans-stimulation effects of folic acid derivatives on methotrexate transport by rat renal organic anion transporter, OAT-K1. J Pharmacol Exp Ther 293:1034-9 (2000) Target
Name:
Solute carrier organic anion transporter family member 1A3
Synonyms:
OAT-K1 Oatp1a3 Slc21a4 Sodium-independent organic anion transporter K1 rOAT-K
Type:
PROTEIN
Mol. Mass.:
73829.31
Organism:
Rattus norvegicus
Description:
ChEMBL_838743
Residue:
670
  
Inhibitor
Name:
BDBM286
Synonyms:
(2S)-2-{[4-({[(6S)-2-amino-5-formyl-4-oxo-1,4,5,6,7,8-hexahydropteridin-6-yl]methyl}amino)phenyl]formamido}pentanedioic acid Folinic Acid LEVOLEUCOVORIN CALCIUM Levoleucovorin
Type:
Small organic molecule
Emp. Form.:
C20H23N7O7
Mol. Mass.:
473.4393
SMILES:
Nc1nc2NC[C@H](CNc3ccc(cc3)C(=O)N[C@@H](CCC(O)=O)C(O)=O)N(C=O)c2c(=O)[nH]1
: