Target
Solute carrier family 22 member 1
Ligand
BDBM39687
Substrate
Meas. Tech.
ChEMBL_838296 (CHEMBL2076244)
Ki
360±n/a nM
Citation
 Gründemann, DGorboulev, VGambaryan, SVeyhl, MKoepsell, H Drug excretion mediated by a new prototype of polyspecific transporter. Nature 372:549-552 (1994)  
Target
Name:
Solute carrier family 22 member 1
Synonyms:
Adrenaline alpha1 Organic cation transporter 1 Slc22a1 adrenergic Alpha1 | rOCT1
Type:
Enzyme Catalytic Domain
Mol. Mass.:
61538.40
Organism:
RAT
Description:
Adrenaline alpha1 0 RAT::Q63089
Residue:
556
  
Inhibitor
Name:
BDBM39687
Synonyms:
(2E)-1-ethyl-2-[(1-ethyl-2-quinolin-1-iumyl)methylidene]quinoline;chloride (2E)-1-ethyl-2-[(1-ethylquinolin-1-ium-2-yl)methylidene]quinoline;chloride CHEMBL1197556 SMR000137574 | cid_5717105
Type:
Small organic molecule
Emp. Form.:
C23H23N2
Mol. Mass.:
327.4416
SMILES:
CCN1\C(=C\c2ccc3ccccc3[n+]2CC)C=Cc2ccccc12
: