Target
Multidrug resistance-associated protein 1
Ligand
BDBM50344959
Substrate
Meas. Tech.
ChEMBL_838239 (CHEMBL2075749)
Ki
22000±n/a nM
Citation
 Loe, DWAlmquist, KCCole, SPDeeley, RG ATP-dependent 17 beta-estradiol 17-(beta-D-glucuronide) transport by multidrug resistance protein (MRP). Inhibition by cholestatic steroids. J Biol Chem 271:9683-9 (1996)  
Target
Name:
Multidrug resistance-associated protein 1
Synonyms:
7.6.2.2 ABCC1 ATP-binding cassette, sub-family C, member 1 isoform 1 LTC4 transporter MRP MRP1_HUMAN
Type:
Mol. Mass.:
171597.72
Organism:
Homo sapiens (Human)
Description:
P33527
Residue:
1531
  
Inhibitor
Name:
BDBM50344959
Synonyms:
17beta-Estradiol-17-(beta-D-glucuronide) E17β-glucuronide | estradiol 17b glucuronide
Type:
Small organic molecule
Emp. Form.:
C24H32O8
Mol. Mass.:
448.5061
SMILES:
C[C@]12CC[C@H]3[C@@H](CCc4cc(O)ccc34)[C@@H]1CC[C@@H]2O[C@@H]1O[C@@H]([C@@H](O)[C@H](O)[C@H]1O)C(O)=O
: