Target
ATP-binding cassette sub-family C member 4
Ligand
BDBM50017691
Substrate
Meas. Tech.
ChEMBL_835930 (CHEMBL2077068)
IC50
20000±n/a nM
Citation
 Reid, GWielinga, PZelcer, NDe Haas, MVan Deemter, LWijnholds, JBalzarini, JBorst, P Characterization of the transport of nucleoside analog drugs by the human multidrug resistance proteins MRP4 and MRP5. Mol Pharmacol 63:1094-103 (2003)  
Target
Name:
ATP-binding cassette sub-family C member 4
Synonyms:
ABCC4 MOAT-B MRP/cMOAT-related ABC transporter MRP4_HUMAN Multidrug resistance-associated protein 4
Type:
PROTEIN
Mol. Mass.:
149546.12
Organism:
Homo sapiens (Human)
Description:
ChEMBL_1486828
Residue:
1325
  
Inhibitor
Name:
BDBM50017691
Synonyms:
CHEMBL126075 | dilazep
Type:
Small organic molecule
Emp. Form.:
C31H44N2O10
Mol. Mass.:
604.6885
SMILES:
COc1cc(cc(OC)c1OC)C(=O)OCCCN1CCCN(CCCOC(=O)c2cc(OC)c(OC)c(OC)c2)CC1
: