Target
Solute carrier family 22 member 1
Ligand
BDBM50079455
Substrate
Meas. Tech.
ChEMBL_839183 (CHEMBL2077854)
Ki
2040000±n/a nM
Citation
 Dresser, MJGray, ATGiacomini, KM Kinetic and selectivity differences between rodent, rabbit, and human organic cation transporters (OCT1). J Pharmacol Exp Ther 292:1146-52 (2000) Target
Name:
Solute carrier family 22 member 1
Synonyms:
Lx1 Organic cation transporter 1 Slc22a1 | mOCT1
Type:
PROTEIN
Mol. Mass.:
61521.43
Organism:
Mus musculus
Description:
ChEMBL_1279071
Residue:
556
  
Inhibitor
Name:
BDBM50079455
Synonyms:
CHEMBL46486 | tetramethylammonium
Type:
Small organic molecule
Emp. Form.:
C4H12N
Mol. Mass.:
74.1442
SMILES:
C[N+](C)(C)C
: