Target
Solute carrier organic anion transporter family member 1A1
Ligand
BDBM50420248
Substrate
Meas. Tech.
ChEMBL_838286 (CHEMBL2076234)
Ki
3800±n/a nM
Citation
 Kanai, NLu, RBao, YWolkoff, AWVore, MSchuster, VL Estradiol 17 beta-D-glucuronide is a high-affinity substrate for oatp organic anion transporter. Am J Physiol 270:326-31 (1996)  
Target
Name:
Solute carrier organic anion transporter family member 1A1
Synonyms:
OATP-1 Oatp1a1 SO1A1_RAT Slco1a1 Solute carrier family 21 member 1
Type:
PROTEIN
Mol. Mass.:
74188.94
Organism:
Rattus norvegicus
Description:
ChEMBL_838286
Residue:
670
  
Inhibitor
Name:
BDBM50420248
Synonyms:
CHEMBL2074651
Type:
Small organic molecule
Emp. Form.:
C25H36O8
Mol. Mass.:
464.5485
SMILES:
C[C@]12CC[C@H]3[C@@H](CCC4=CC(=O)CC[C@]34C)[C@@H]1CC[C@@H]2O[C@@H]1O[C@@H]([C@@H](O)[C@H](O)[C@H]1O)C(O)=O
: