Target
Casein kinase I isoform alpha
Ligand
BDBM50420285
Substrate
Meas. Tech.
ChEMBL_842102 (CHEMBL2091519)
IC50
>10000±n/a nM
Citation
 Yang, LLLi, GBYan, HXSun, QZMa, SJi, PWang, ZRFeng, SZou, JYang, SY Discovery of N6-phenyl-1H-pyrazolo[3,4-d]pyrimidine-3,6-diamine derivatives as novel CK1 inhibitors using common-feature pharmacophore model based virtual screening and hit-to-lead optimization. Eur J Med Chem 56:30-38 (2012)  
Target
Name:
Casein kinase I isoform alpha
Synonyms:
CK1 CSNK1A1 Casein kinase 1 alpha (CK1 alpha) KC1A_HUMAN
Type:
Serine/threonine-protein kinase
Mol. Mass.:
38936.59
Organism:
Homo sapiens (Human)
Description:
P48729
Residue:
337
  
Inhibitor
Name:
BDBM50420285
Synonyms:
CHEMBL2089216
Type:
Small organic molecule
Emp. Form.:
C20H20N8O
Mol. Mass.:
388.4258
SMILES:
C[C@@H](NC(=O)Nc1ccc(Nc2ncc3c(N)[nH]nc3n2)cc1)c1ccccc1
: