Target
Cyclin-dependent kinase 5 activator 1
Ligand
BDBM50420298
Substrate
Meas. Tech.
ChEMBL_839631 (CHEMBL2090652)
IC50
270±n/a nM
Citation
 Bettayeb, KGresh, NMeijer, LOumata, N Synthesis and biological evaluation of selective and potent cyclin-dependent kinase inhibitors. Eur J Med Chem 56:210-216 (2012)  
Target
Name:
Cyclin-dependent kinase 5 activator 1
Synonyms:
CDK5/p35 Cyclin-dependent kinase 5 regulatory subunit 1 | Cyclin-dependent kinase 5/CDK5 activator 1
Type:
Protein Complex
Mol. Mass.:
Description:
Components:
This complex has 2 components.
Component 1
Name:
Cyclin-dependent kinase 5
Synonyms:
CDK5 CDKN5 Cyclin-dependent kinase 5 (CDK5/ p25) Cyclin-dependent-like kinase 5 PSSALRE Tau protein kinase II catalytic subunit
Type:
Enzyme Subunit
Mol. Mass.:
33308.61
Organism:
Homo sapiens (Human)
Description:
Residue:
292
  
Component 2
Name:
Cyclin-dependent kinase 5 activator 1
Synonyms:
CD5R1_HUMAN CDK5R1 Cyclin-dependent kinase 5 (CDK5/p25) NCK5A p35
Type:
Enzyme Subunit
Mol. Mass.:
34077.43
Organism:
Homo sapiens (Human)
Description:
Q15078
Residue:
307
  
Inhibitor
Name:
BDBM50420298
Synonyms:
CHEMBL2089033
Type:
Small organic molecule
Emp. Form.:
C26H31N7O2
Mol. Mass.:
473.57
SMILES:
CC(C)n1cnc2c(NCc3ccc(cc3)-c3ccccn3)nc(N[C@@H]3CCC[C@H](O)[C@@H]3O)nc12
: