Target
Cytochrome P450 2C9
Ligand
BDBM50420297
Substrate
Meas. Tech.
ChEMBL_839757 (CHEMBL2089679)
IC50
>5000±n/a nM
Citation
 Bettayeb, KGresh, NMeijer, LOumata, N Synthesis and biological evaluation of selective and potent cyclin-dependent kinase inhibitors. Eur J Med Chem 56:210-216 (2012)  
Target
Name:
Cytochrome P450 2C9
Synonyms:
(R)-limonene 6-monooxygenase CP2C9_HUMAN CYP2C9 Cytochrome P450 2C9 (CYP2C9 ) P-450MP P450 PB-1 | S-mephenytoin 4-hydroxylase
Type:
Enzyme
Mol. Mass.:
55636.33
Organism:
Homo sapiens (Human)
Description:
P11712
Residue:
490
  
Inhibitor
Name:
BDBM50420297
Synonyms:
CHEMBL2089032
Type:
Small organic molecule
Emp. Form.:
C23H27N7O2
Mol. Mass.:
433.5062
SMILES:
CC(C)n1cnc2c(NCc3ccc(cc3)-c3ccccn3)nc(NC[C@@H](O)CO)nc12
: