Target
Cyclin-dependent kinase/G2/mitotic-specific cyclin- 1
Ligand
BDBM50420303
Substrate
Meas. Tech.
ChEMBL_839773 (CHEMBL2089695)
IC50
>15000±n/a nM
Citation
 Cho, YSAngove, HBrain, CChen, CHCheng, HCheng, RChopra, RChung, KCongreve, MDagostin, CDavis, DJFeltell, RGiraldes, JHiscock, SDKim, SKovats, SLagu, BLewry, KLoo, ALu, YLuzzio, MManiara, WMcMenamin, RMortenson, PNBenning, RRees, DCShen, JSmith, TWang, YWilliams, GWoolford, AJWrona, WXu, MYang, FHoward, S Fragment-Based Discovery of 7-Azabenzimidazoles as Potent, Highly Selective, and Orally Active CDK4/6 Inhibitors. ACS Med Chem Lett 3:445-449 (2012)  
Target
Name:
Cyclin-dependent kinase/G2/mitotic-specific cyclin- 1
Synonyms:
CDK1/B CDK1/CyclinB Cyclin-Dependent Kinase 1 (CDK1) Cyclin-dependent kinase/G2/mitotic-specific cyclin 1 | cdk1
Type:
Protein Complex
Mol. Mass.:
Description:
CDK1/Cyclin B complexes were purified from insect cells co-infected with baculovirus vectors containing each of the components.
Components:
This complex has 2 components.
Component 1
Name:
Cyclin-dependent kinase 1
Synonyms:
CDC2 CDK1 CDKN1 Cell division protein kinase 1 P34CDC2 | p34 protein kinase
Type:
Enzyme Subunit
Mol. Mass.:
34101.08
Organism:
Homo sapiens (Human)
Description:
P06493
Residue:
297
  
Component 2
Name:
G2/mitotic-specific cyclin-B1
Synonyms:
CCNB CCNB1_HUMAN
Type:
Enzyme Subunit
Mol. Mass.:
48340.95
Organism:
Homo sapiens (Human)
Description:
P14635
Residue:
433
  
Inhibitor
Name:
BDBM50420303
Synonyms:
CHEMBL2089064 | US8598217, 135
Type:
Small organic molecule
Emp. Form.:
C28H27N7O
Mol. Mass.:
477.5603
SMILES:
CN(C)C1CCN(CC1)c1ccc2[nH]c(nc2n1)C(=O)c1ccnc(c1)-c1cncc2ccccc12
: