Target
40S ribosomal protein S27
Ligand
BDBM50420398
Substrate
Meas. Tech.
ChEMBL_840521 (CHEMBL2089872)
IC50
3970±n/a nM
Citation
 Kusakabe, KIde, NDaigo, YItoh, THigashino, KOkano, YTadano, GTachibana, YSato, YInoue, MWada, TIguchi, MKanazawa, TIshioka, YDohi, KTagashira, SKido, YSakamoto, SYasuo, KMaeda, MYamamoto, THigaki, MEndoh, TUeda, KShiota, TMurai, HNakamura, Y Diaminopyridine-based potent and selective mps1 kinase inhibitors binding to an unusual flipped-Peptide conformation. ACS Med Chem Lett 3:560-564 (2012)  
Target
Name:
40S ribosomal protein S27
Synonyms:
MPS-1 Metallopan-stimulin 1 RS27_HUMAN
Type:
PROTEIN
Mol. Mass.:
9472.13
Organism:
Homo sapiens (Human)
Description:
ChEMBL_1446775
Residue:
84
  
Inhibitor
Name:
BDBM50420398
Synonyms:
CHEMBL2089252
Type:
Small organic molecule
Emp. Form.:
C16H18N4O
Mol. Mass.:
282.3403
SMILES:
CCOc1nc(NCCc2ccccc2)cc(N)c1C#N
: