Target
Mitogen-activated protein kinase 8
Ligand
BDBM15912
Substrate
Meas. Tech.
ChEMBL_840522 (CHEMBL2089873)
IC50
350±n/a nM
Citation
 Kusakabe, KIde, NDaigo, YItoh, THigashino, KOkano, YTadano, GTachibana, YSato, YInoue, MWada, TIguchi, MKanazawa, TIshioka, YDohi, KTagashira, SKido, YSakamoto, SYasuo, KMaeda, MYamamoto, THigaki, MEndoh, TUeda, KShiota, TMurai, HNakamura, Y Diaminopyridine-based potent and selective mps1 kinase inhibitors binding to an unusual flipped-Peptide conformation. ACS Med Chem Lett 3:560-564 (2012)  
Target
Name:
Mitogen-activated protein kinase 8
Synonyms:
JNK-46 JNK1-alpha-1 MK08_HUMAN PRKM8 SAPK1C c-Jun N-terminal kinase 1 c-Jun N-terminal kinase 1(JNK1) | c-Jun N-terminal kinase 2 (JNK2)
Type:
Enzyme
Mol. Mass.:
48297.57
Organism:
Homo sapiens (Human)
Description:
JNK-1 was purchased from Upstate Cell Signaling Solutions (formerly Upstate Biotechnology).
Residue:
427
  
Inhibitor
Name:
BDBM15912
Synonyms:
2-pyridinecarboxamide deriv. 8b 4-amino-N-benzyl-5-cyano-6-ethoxypyridine-2-carboxamide
Type:
Small organic molecule
Emp. Form.:
C16H16N4O2
Mol. Mass.:
296.3238
SMILES:
CCOc1nc(cc(N)c1C#N)C(=O)NCc1ccccc1
: