Target
Mitogen-activated protein kinase 8
Ligand
BDBM50420401
Substrate
Meas. Tech.
ChEMBL_840522 (CHEMBL2089873)
IC50
231±n/a nM
Citation
 Kusakabe, KIde, NDaigo, YItoh, THigashino, KOkano, YTadano, GTachibana, YSato, YInoue, MWada, TIguchi, MKanazawa, TIshioka, YDohi, KTagashira, SKido, YSakamoto, SYasuo, KMaeda, MYamamoto, THigaki, MEndoh, TUeda, KShiota, TMurai, HNakamura, Y Diaminopyridine-based potent and selective mps1 kinase inhibitors binding to an unusual flipped-Peptide conformation. ACS Med Chem Lett 3:560-564 (2012)  
Target
Name:
Mitogen-activated protein kinase 8
Synonyms:
JNK-46 JNK1-alpha-1 MK08_HUMAN PRKM8 SAPK1C c-Jun N-terminal kinase 1 c-Jun N-terminal kinase 1(JNK1) | c-Jun N-terminal kinase 2 (JNK2)
Type:
Enzyme
Mol. Mass.:
48297.57
Organism:
Homo sapiens (Human)
Description:
JNK-1 was purchased from Upstate Cell Signaling Solutions (formerly Upstate Biotechnology).
Residue:
427
  
Inhibitor
Name:
BDBM50420401
Synonyms:
CHEMBL2089255 | US11208696, Example 31
Type:
Small organic molecule
Emp. Form.:
C17H20N6O
Mol. Mass.:
324.3803
SMILES:
CC(C)(C)Nc1nc(Nc2ccc(cc2)C(N)=O)cc(N)c1C#N
: