Target
Coagulation factor XIII A chain
Ligand
BDBM50420437
Substrate
Meas. Tech.
ChEMBL_841034 (CHEMBL2091160)
IC50
430±n/a nM
Citation
 Prime, MEAndersen, OABarker, JJBrooks, MACheng, RKToogood-Johnson, ICourtney, SMBrookfield, FAYarnold, CJMarston, RWJohnson, PDJohnsen, SFPalfrey, JJVaidya, DErfan, SIchihara, OFelicetti, BPalan, SPedret-Dunn, ASchaertl, SSternberger, IEbneth, AScheel, AWinkler, DToledo-Sherman, LBeconi, MMacdonald, DMuñoz-Sanjuan, IDominguez, CWityak, J Discovery and structure-activity relationship of potent and selective covalent inhibitors of transglutaminase 2 for Huntington's disease. J Med Chem 55:1021-46 (2012)  
Target
Name:
Coagulation factor XIII A chain
Synonyms:
Coagulation factor XIII F13A1 | F13A_HUMAN
Type:
PROTEIN
Mol. Mass.:
83261.29
Organism:
Homo sapiens (Human)
Description:
ChEMBL_1475048
Residue:
732
  
Inhibitor
Name:
BDBM50420437
Synonyms:
CHEMBL2089386
Type:
Small organic molecule
Emp. Form.:
C18H25N3O5S
Mol. Mass.:
395.473
SMILES:
CC(C)(C)OC(=O)N1CCN(CC1)S(=O)(=O)c1ccc(NC(=O)C=C)cc1
: