Target
Protein-glutamine gamma-glutamyltransferase E
Ligand
BDBM50420499
Substrate
Meas. Tech.
ChEMBL_841033 (CHEMBL2091159)
IC50
>80000±n/a nM
Citation
 Prime, MEAndersen, OABarker, JJBrooks, MACheng, RKToogood-Johnson, ICourtney, SMBrookfield, FAYarnold, CJMarston, RWJohnson, PDJohnsen, SFPalfrey, JJVaidya, DErfan, SIchihara, OFelicetti, BPalan, SPedret-Dunn, ASchaertl, SSternberger, IEbneth, AScheel, AWinkler, DToledo-Sherman, LBeconi, MMacdonald, DMuñoz-Sanjuan, IDominguez, CWityak, J Discovery and structure-activity relationship of potent and selective covalent inhibitors of transglutaminase 2 for Huntington's disease. J Med Chem 55:1021-46 (2012)  
Target
Name:
Protein-glutamine gamma-glutamyltransferase E
Synonyms:
Protein-glutamine glutamyltransferase E TGM3_HUMAN | Transglutaminase-3 (TG3)
Type:
Protein
Mol. Mass.:
76625.90
Organism:
Homo sapiens (Human)
Description:
Residue:
693
  
Inhibitor
Name:
BDBM50420499
Synonyms:
CHEMBL2086501
Type:
Small organic molecule
Emp. Form.:
C26H34N4O5S
Mol. Mass.:
514.637
SMILES:
CC(C)CN(C)c1cc(ccc1NC(=O)C=C)S(=O)(=O)N1CCN(CC1)C(=O)OCc1ccccc1
: