Target
Coagulation factor XIII A chain
Ligand
BDBM50420524
Substrate
Meas. Tech.
ChEMBL_841034 (CHEMBL2091160)
IC50
410±n/a nM
Citation
 Prime, MEAndersen, OABarker, JJBrooks, MACheng, RKToogood-Johnson, ICourtney, SMBrookfield, FAYarnold, CJMarston, RWJohnson, PDJohnsen, SFPalfrey, JJVaidya, DErfan, SIchihara, OFelicetti, BPalan, SPedret-Dunn, ASchaertl, SSternberger, IEbneth, AScheel, AWinkler, DToledo-Sherman, LBeconi, MMacdonald, DMuñoz-Sanjuan, IDominguez, CWityak, J Discovery and structure-activity relationship of potent and selective covalent inhibitors of transglutaminase 2 for Huntington's disease. J Med Chem 55:1021-46 (2012)  
Target
Name:
Coagulation factor XIII A chain
Synonyms:
Coagulation factor XIII F13A1 | F13A_HUMAN
Type:
PROTEIN
Mol. Mass.:
83261.29
Organism:
Homo sapiens (Human)
Description:
ChEMBL_1475048
Residue:
732
  
Inhibitor
Name:
BDBM50420524
Synonyms:
CHEMBL2089389
Type:
Small organic molecule
Emp. Form.:
C21H23N3O5S
Mol. Mass.:
429.489
SMILES:
C=CC(=O)Nc1ccc(cc1)S(=O)(=O)N[C@@H]1CCN(C1)C(=O)OCc1ccccc1
: