Target
Transient receptor potential cation channel subfamily M member 8
Ligand
BDBM50240432
Substrate
Meas. Tech.
ChEMBL_842223 (CHEMBL2091728)
EC50
52200±n/a nM
Citation
 Ortar, GMorera, LMoriello, ASMorera, ENalli, MDi Marzo, VDe Petrocellis, L Modulation of thermo-transient receptor potential (thermo-TRP) channels by thymol-based compounds. Bioorg Med Chem Lett 22:3535-9 (2012)  
Target
Name:
Transient receptor potential cation channel subfamily M member 8
Synonyms:
Cmr1 Transient receptor potential M8 protein (TRPM8) Trpm8
Type:
Enzyme
Mol. Mass.:
127633.53
Organism:
Rattus norvegicus (Rat)
Description:
Q8R455
Residue:
1104
  
Inhibitor
Name:
BDBM50240432
Synonyms:
1-hydroxy-5-methyl-2-isopropylbenzene 3-p-cymenol 5-methyl-2-isopropylphenol 6-isopropyl-m-cresol thymol
Type:
Small organic molecule
Emp. Form.:
C10H14O
Mol. Mass.:
150.2176
SMILES:
CC(C)c1ccc(C)cc1O
: