Target
Caspase-3
Ligand
BDBM10354
Substrate
Meas. Tech.
ChEMBL_842368 (CHEMBL2091985)
IC50
20.42±n/a nM
Citation
 Hasegawa, KFunatsu, K New description of protein-ligand interactions using a spherical self-organizing map. Bioorg Med Chem 20:5410-5 (2012)  
Target
Name:
Caspase-3
Synonyms:
Apopain CASP3 CPP-32 Caspase 3 Caspase-3 subunit p17 SCA-1 Yama protein | caspase-3 preproprotein
Type:
Hydrolase; heterotetramer of two heterodimers
Mol. Mass.:
31607.55
Organism:
Homo sapiens (Human)
Description:
Residue:
277
  
Inhibitor
Name:
BDBM10354
Synonyms:
5-(2-(Pyridin-4-yl-oxymethyl)-pyrrolidine-1-sulfonyl)-1H-indole-2,3-dione Pyridine Analogue 23
Type:
Small organic molecule
Emp. Form.:
C18H17N3O5S
Mol. Mass.:
387.41
SMILES:
O=C1Nc2ccc(cc2C1=O)S(=O)(=O)N1CCC[C@H]1COc1ccncc1
: