Target
Dual specificity mitogen-activated protein kinase kinase 1
Ligand
BDBM50420701
Substrate
Meas. Tech.
ChEMBL_842395 (CHEMBL2092012)
EC50
0.9±n/a nM
Citation
 Heald, RAJackson, PSavy, PJones, MGancia, EBurton, BNewman, RBoggs, JChan, EChan, JChoo, EMerchant, MRudewicz, PUltsch, MWiesmann, CYue, QBelvin, MPrice, S Discovery of novel allosteric mitogen-activated protein kinase kinase (MEK) 1,2 inhibitors possessing bidentate Ser212 interactions. J Med Chem 55:4594-604 (2012)  
Target
Name:
Dual specificity mitogen-activated protein kinase kinase 1
Synonyms:
Dual specificity mitogen-activated protein kinase (MEK) Dual specificity mitogen-activated protein kinase kinase 1 (MEK1) Dual specificity mitogen-activated protein kinase kinase MEK1/2 MAP kinase kinase 1 MAPK/ERK kinase 1 MEK-1 MP2K1_HUMAN PRKMK1 | VHL-MAP2K1/MAP2K2
Type:
Other Protein Type
Mol. Mass.:
43439.03
Organism:
Homo sapiens (Human)
Description:
Full-length human MEK-1 was generated by PCR and purified as a fusion protein from Escherichia coli lysates.
Residue:
393
  
Inhibitor
Name:
BDBM50420701
Synonyms:
CHEMBL2087461
Type:
Small organic molecule
Emp. Form.:
C16H13FIN3O3S
Mol. Mass.:
473.261
SMILES:
OCCONC(=O)c1ccc2cnsc2c1Nc1ccc(I)cc1F
: