Target
Nociceptin receptor
Ligand
BDBM50400871
Substrate
Meas. Tech.
ChEMBL_839690 (CHEMBL2090804)
Ki
0.231000±n/a nM
Citation
 Pedregal, CJoshi, EMToledo, MALafuente, CDiaz, NMartinez-Grau, MAJiménez, ABenito, ANavarro, AChen, ZMudra, DRKahl, SDRash, KSStatnick, MABarth, VN Development of LC-MS/MS-based receptor occupancy tracers and positron emission tomography radioligands for the nociceptin/orphanin FQ (NOP) receptor. J Med Chem 55:4955-67 (2012)  
Target
Name:
Nociceptin receptor
Synonyms:
KOR-3 Mu-type opioid receptor (Mu) Nociceptin Receptor (ORL1 Receptor) Nociceptin receptor (ORL-1) Nociceptin/Orphanin FQ, NOP receptor OPIATE ORL-1 OPRL1 protein ORL1 Opioid receptor like-1 Orphanin FQ receptor (ORL1) | P41146
Type:
G Protein-Coupled Receptor (GPCR)
Mol. Mass.:
40702.87
Organism:
Homo sapiens (Human)
Description:
P41146
Residue:
370
  
Inhibitor
Name:
BDBM50400871
Synonyms:
CHEMBL2088030
Type:
Small organic molecule
Emp. Form.:
C24H30F2N2O2S
Mol. Mass.:
448.569
SMILES:
CC(C)NC(=O)[C@H](CN1CCC2(CC1)OCCc1cc(F)sc21)Cc1ccccc1F
: