Target
Amine oxidase [flavin-containing] B
Ligand
BDBM50420978
Substrate
Meas. Tech.
ChEMBL_840938 (CHEMBL2090976)
IC50
5780±n/a nM
Citation
 Okaecwe, TSwanepoel, AJPetzer, ABergh, JJPetzer, JP Inhibition of monoamine oxidase by 8-phenoxymethylcaffeine derivatives. Bioorg Med Chem 20:4336-47 (2012)  
Target
Name:
Amine oxidase [flavin-containing] B
Synonyms:
AOFB_HUMAN MAOB Monoamine oxidase type B (MAO B) Monoamine oxidase type B (MAOB)
Type:
Protein
Mol. Mass.:
58768.76
Organism:
Homo sapiens (Human)
Description:
P27338
Residue:
520
  
Inhibitor
Name:
BDBM50420978
Synonyms:
8-Phenoxymethylcaffeine (8a) | CHEMBL2088299
Type:
Small organic molecule
Emp. Form.:
C15H16N4O3
Mol. Mass.:
300.3125
SMILES:
Cn1c(COc2ccccc2)nc2n(C)c(=O)n(C)c(=O)c12
: