Target
Ribosomal protein S6 kinase alpha-3
Ligand
BDBM50420996
Substrate
Meas. Tech.
ChEMBL_841529 (CHEMBL2091835)
IC50
3±n/a nM
Citation
 Kim, MHTsuhako, ALCo, EWAftab, DTBentzien, FChen, JCheng, WEngst, SGoon, LKlein, RRLe, DTMac, MParks, JJQian, FRodriquez, MStout, TJTill, JHWon, KAWu, XYakes, FMYu, PZhang, WZhao, YLamb, PNuss, JMXu, W The design, synthesis, and biological evaluation of potent receptor tyrosine kinase inhibitors. Bioorg Med Chem Lett 22:4979-85 (2012)  
Target
Name:
Ribosomal protein S6 kinase alpha-3
Synonyms:
90 kDa ribosomal protein S6 kinase 3 ISPK1 MAP kinase-activated protein kinase 1b RPS6KA3 RSK2 Ribosomal protein S6 kinase Ribosomal protein S6 kinase alpha-3 (RSK2) S6K-alpha 3 p90 ribosomal s6 kinase (RSK2) p90RSK | pp90RSK2
Type:
Serine/threonine-protein kinase
Mol. Mass.:
83740.03
Organism:
Homo sapiens (Human)
Description:
The human RSK2 sequence differed from the Genbank entry NM_004586 at one residue, V45G. The protein was cloned and purified from baculovirus expression system.
Residue:
740
  
Inhibitor
Name:
BDBM50420996
Synonyms:
CHEMBL2086760
Type:
Small organic molecule
Emp. Form.:
C25H26ClN5O
Mol. Mass.:
447.96
SMILES:
CCN1CCC(CC1)Nc1ccc2NC(=O)C(=C(c3ncc[nH]3)c3ccc(Cl)cc3)c2c1
: