Target
Vascular endothelial growth factor receptor 1
Ligand
BDBM50420996
Substrate
Meas. Tech.
ChEMBL_841300 (CHEMBL2090041)
IC50
7±n/a nM
Citation
 Kim, MHTsuhako, ALCo, EWAftab, DTBentzien, FChen, JCheng, WEngst, SGoon, LKlein, RRLe, DTMac, MParks, JJQian, FRodriquez, MStout, TJTill, JHWon, KAWu, XYakes, FMYu, PZhang, WZhao, YLamb, PNuss, JMXu, W The design, synthesis, and biological evaluation of potent receptor tyrosine kinase inhibitors. Bioorg Med Chem Lett 22:4979-85 (2012)  
Target
Name:
Vascular endothelial growth factor receptor 1
Synonyms:
FLT FRT Fms-like tyrosine kinase 1 Tyrosine-protein kinase FRT VEGFR-1 VGFR1_HUMAN Vascular endothelial growth factor receptor 1 (FLT1) Vascular endothelial growth factor receptor 1 and 2 (Flt-1 and KDR) Vascular permeability factor receptor vascular endothelial growth factor/vascular permeability factor receptor
Type:
Receptor Tyrosine Kinase
Mol. Mass.:
150800.23
Organism:
Homo sapiens (Human)
Description:
P17948
Residue:
1338
  
Inhibitor
Name:
BDBM50420996
Synonyms:
CHEMBL2086760
Type:
Small organic molecule
Emp. Form.:
C25H26ClN5O
Mol. Mass.:
447.96
SMILES:
CCN1CCC(CC1)Nc1ccc2NC(=O)C(=C(c3ncc[nH]3)c3ccc(Cl)cc3)c2c1
: