Target
Xanthine dehydrogenase/oxidase
Ligand
BDBM50421159
Substrate
Meas. Tech.
ChEMBL_839550 (CHEMBL2090357)
IC50
48500±n/a nM
Citation
 Bandgar, BPAdsul, LKChavan, HVShringare, SNKorbad, BLJalde, SSLonikar, SVNile, SHShirfule, AL Synthesis, biological evaluation, and molecular docking of N-{3-[3-(9-methyl-9H-carbazol-3-yl)-acryloyl]-phenyl}-benzamide/amide derivatives as xanthine oxidase and tyrosinase inhibitors. Bioorg Med Chem 20:5649-57 (2012)  
Target
Name:
Xanthine dehydrogenase/oxidase
Synonyms:
XDH Xanthine dehydrogenase Xanthine oxidase (XO)
Type:
Protein
Mol. Mass.:
146809.00
Organism:
Bos taurus (Bovine)
Description:
P80457
Residue:
1332
  
Inhibitor
Name:
BDBM50421159
Synonyms:
CHEMBL2088610
Type:
Small organic molecule
Emp. Form.:
C22H18N2O
Mol. Mass.:
326.3911
SMILES:
Cn1c2ccccc2c2cc(\C=C\C(=O)c3cccc(N)c3)ccc12
: