Target
Polyphenol oxidase 2
Ligand
BDBM50421153
Substrate
Meas. Tech.
ChEMBL_839551 (CHEMBL2090358)
IC50
65160±n/a nM
Citation
 Bandgar, BPAdsul, LKChavan, HVShringare, SNKorbad, BLJalde, SSLonikar, SVNile, SHShirfule, AL Synthesis, biological evaluation, and molecular docking of N-{3-[3-(9-methyl-9H-carbazol-3-yl)-acryloyl]-phenyl}-benzamide/amide derivatives as xanthine oxidase and tyrosinase inhibitors. Bioorg Med Chem 20:5649-57 (2012)  
Target
Name:
Polyphenol oxidase 2
Synonyms:
Monophenol monooxygenase PPO2 Tyrosinase
Type:
Protein
Mol. Mass.:
63923.66
Organism:
Agaricus bisporus (Common mushroom)
Description:
O42713
Residue:
556
  
Inhibitor
Name:
BDBM50421153
Synonyms:
CHEMBL2088604
Type:
Small organic molecule
Emp. Form.:
C30H21F3N2O2
Mol. Mass.:
498.4951
SMILES:
Cn1c2ccccc2c2cc(\C=C\C(=O)c3cccc(NC(=O)c4cccc(c4)C(F)(F)F)c3)ccc12
: