Target
Beta-lactamase
Ligand
BDBM50421220
Substrate
Meas. Tech.
ChEMBL_839905 (CHEMBL2090106)
IC50
5500±n/a nM
Citation
 Chen, PHorton, LBMikulski, RLDeng, LSundriyal, SPalzkill, TSong, Y 2-Substituted 4,5-dihydrothiazole-4-carboxylic acids are novel inhibitors of metallo-ß-lactamases. Bioorg Med Chem Lett 22:6229-32 (2012)  
Target
Name:
Beta-lactamase
Synonyms:
Beta-lactamase | metallo-beta-lactamase IMP-1
Type:
Enzyme Catalytic Domain
Mol. Mass.:
27125.88
Organism:
Pseudomonas aeruginosa
Description:
gi_27368096
Residue:
246
  
Inhibitor
Name:
BDBM50421220
Synonyms:
CHEMBL2087628
Type:
Small organic molecule
Emp. Form.:
C10H9NO2S
Mol. Mass.:
207.249
SMILES:
OC(=O)[C@@H]1CSC(=N1)c1ccccc1
: