Target
Activated CDC42 kinase 1
Ligand
BDBM50421293
Substrate
Meas. Tech.
ChEMBL_840100 (CHEMBL2090704)
IC50
420±n/a nM
Citation
 Jiao, XKopecky, DJLiu, JLiu, JJaen, JCCardozo, MGSharma, RWalker, NWesche, HLi, SFarrelly, EXiao, SHWang, ZKayser, F Synthesis and optimization of substituted furo[2,3-d]-pyrimidin-4-amines and 7H-pyrrolo[2,3-d]pyrimidin-4-amines as ACK1 inhibitors. Bioorg Med Chem Lett 22:6212-7 (2012)  
Target
Name:
Activated CDC42 kinase 1
Synonyms:
ACK-1 Ack1 Tnk2
Type:
PROTEIN
Mol. Mass.:
116986.19
Organism:
Mus musculus
Description:
ChEMBL_840100
Residue:
1055
  
Inhibitor
Name:
BDBM50421293
Synonyms:
CHEMBL2087881
Type:
Small organic molecule
Emp. Form.:
C28H33N5O2
Mol. Mass.:
471.5939
SMILES:
CO[C@@H]1CC[C@H]1CNc1ncnc2[nH]c(c(-c3ccccc3)c12)-c1ccc(OCCN(C)C)cc1
: