Target
Vascular endothelial growth factor A
Ligand
BDBM50421314
Substrate
Meas. Tech.
ChEMBL_840112 (CHEMBL2090815)
Kd
198000±n/a nM
Citation
 Liu, LLi, CCochran, SFeder, DGuddat, LWFerro, V A focused sulfated glycoconjugate Ugi library for probing heparan sulfate-binding angiogenic growth factors. Bioorg Med Chem Lett 22:6190-4 (2012)  
Target
Name:
Vascular endothelial growth factor A
Synonyms:
VEGF VEGFA VPF Vascular endothelial growth factor A (VEGF) Vascular permeability factor
Type:
Protein
Mol. Mass.:
27063.81
Organism:
Homo sapiens (Human)
Description:
P15692
Residue:
232
  
Inhibitor
Name:
BDBM50421314
Synonyms:
CHEMBL2087912
Type:
Small organic molecule
Emp. Form.:
C7H10O18S4
Mol. Mass.:
510.406
SMILES:
CO[C@H]1O[C@H](COS([O-])(=O)=O)[C@@H](OS([O-])(=O)=O)[C@H](OS([O-])(=O)=O)[C@@H]1OS([O-])(=O)=O
: