Target
5-hydroxytryptamine receptor 4
Ligand
BDBM82505
Substrate
Meas. Tech.
ChEMBL_201063 (CHEMBL805839)
Ki
0.125893±n/a nM
Citation
  TBA Bioorg Med Chem Lett 4:667-668 (1994)    Article 
Target
Name:
5-hydroxytryptamine receptor 4
Synonyms:
5-hydroxytryptamine receptor 4 protein | Serotonin 4 (5-HT4) receptor
Type:
PROTEIN
Mol. Mass.:
45024.02
Organism:
Sus scrofa
Description:
ChEMBL_1297282
Residue:
402
  
Inhibitor
Name:
BDBM82505
Synonyms:
CAS_121881 SB204070
Type:
Small organic molecule
Emp. Form.:
C19H27ClN2O4
Mol. Mass.:
382.882
SMILES:
CCCCN1CCC(COC(=O)c2cc(Cl)c(N)c3OCCOc23)CC1
: