Target
Motilin receptor
Ligand
BDBM50421366
Substrate
Meas. Tech.
ChEMBL_122665 (CHEMBL732795)
pH
2.5±n/a
IC50
302±n/a nM
Comments
extracted
Citation
  TBA Bioorg Med Chem Lett 5:835-838 (1995)    Article 
Target
Name:
Motilin receptor
Synonyms:
G-protein coupled receptor 38 MLNR MTLR1 | MTLR_HUMAN
Type:
PROTEIN
Mol. Mass.:
45365.95
Organism:
Homo sapiens (Human)
Description:
ChEMBL_122664
Residue:
412
  
Inhibitor
Name:
BDBM50421366
Synonyms:
CHEMBL353526
Type:
Small organic molecule
Emp. Form.:
C37H65NO12
Mol. Mass.:
715.9115
SMILES:
CCC1OC(=O)C(C)C(C[C@@H](OC2OC(C)CC([C@H]2O)N(C)CC)[C@]2(C)CC(C)=C(O2)[C@H](C)[C@@H](O)[C@]1(C)O)OC1C[C@@](C)(OC)[C@@H](O)C(C)O1
: