Target
Integrin alpha-IIb/beta-3
Ligand
BDBM50421459
Substrate
Meas. Tech.
ChEMBL_70360 (CHEMBL677185)
IC50
41±n/a nM
Citation
 Miyashita, MAkamatsu, MHayashi, YUeno, T Three-dimensional quantitative structure-activity relationship analyses of RGD mimetics as fibrinogen receptor antagonists. Bioorg Med Chem Lett 10:859-63 (2000)  
Target
Name:
Integrin alpha-IIb/beta-3
Synonyms:
Glycoprotein IIb/IIIa
Type:
Mol. Mass.:
Description:
ASSAY_ID of EBI is 30109
Components:
This complex has 2 components.
Component 1
Name:
Integrin beta-3
Synonyms:
CD_antigen=CD61 GPIIIa ITGB3 Platelet membrane glycoprotein IIIa
Type:
Protein
Mol. Mass.:
87038.91
Organism:
Homo sapiens (Human)
Description:
P05106
Residue:
788
  
Component 2
Name:
Integrin alpha-IIb
Synonyms:
CD_antigen=CD41 GPIIb Glycoprotein IIb ITGA2B Integrin alpha-IIb heavy chain Integrin alpha-IIb light chain, form 2 Integrin alpha-V/beta-3 and alpha-IIb/beta 3 | Platelet membrane glycoprotein IIb
Type:
Protein
Mol. Mass.:
113354.85
Organism:
Homo sapiens (Human)
Description:
P08514
Residue:
1039
  
Inhibitor
Name:
BDBM50421459
Synonyms:
CHEMBL172679
Type:
Small organic molecule
Emp. Form.:
C24H36N4O4
Mol. Mass.:
444.567
SMILES:
CC(C)C[C@@H](NC(=O)c1ccc(cc1)C(N)=N)C(C)(C)C(=O)N1CCC(CC(O)=O)CC1
: