Target
Integrin alpha-4/beta-1
Ligand
BDBM50104531
Substrate
Meas. Tech.
ChEMBL_217438 (CHEMBL823337)
IC50
1±n/a nM
Citation
 Duplantier, AJBeckius, GEChambers, RJChupak, LSJenkinson, THKlein, ASKraus, KGKudlacz, EMMcKechney, MWPettersson, MPWhitney, CAMilici, AJ Isoxazolyl, oxazolyl, and thiazolylpropionic acid derivatives as potent alpha(4)beta(1) integrin antagonists. Bioorg Med Chem Lett 11:2593-6 (2001)  
Target
Name:
Integrin alpha-4/beta-1
Synonyms:
Fibronectin receptor beta/Integrin alpha-4 | Integrin alpha-4/beta-1
Type:
Mol. Mass.:
Description:
ASSAY_ID of EBI is 88912
Components:
This complex has 2 components.
Component 1
Name:
Integrin beta-1
Synonyms:
CD_antigen=CD29 Fibronectin receptor beta GPIIA ITGB1 MDF2 | MSK12
Type:
Enzyme
Mol. Mass.:
88400.38
Organism:
Homo sapiens (Human)
Description:
P05556
Residue:
798
  
Component 2
Name:
Integrin alpha-4
Synonyms:
CD49 antigen-like family member D CD49d antigen ITA4_HUMAN Integrin alpha-4 Integrin alpha-IV VLA-4 integrin alpha 4 precursor | integrin alpha-4 precursor
Type:
Membrane Protein
Mol. Mass.:
114897.35
Organism:
Homo sapiens (Human)
Description:
P13612
Residue:
1032
  
Inhibitor
Name:
BDBM50104531
Synonyms:
3-[3-((S)-1-{2-[3-Methoxy-4-(3-o-tolyl-ureido)-phenyl]-acetylamino}-3-methyl-butyl)-isoxazol-5-yl]-propionic acid | CHEMBL86763
Type:
Small organic molecule
Emp. Form.:
C28H34N4O6
Mol. Mass.:
522.5928
SMILES:
COc1cc(CC(=O)N[C@@H](CC(C)C)c2cc(CCC(O)=O)on2)ccc1NC(=O)Nc1ccccc1C
: