Target
Integrin alpha-4/beta-1
Ligand
BDBM50117047
Substrate
Meas. Tech.
ChEMBL_214488 (CHEMBL819216)
IC50
0.440000±n/a nM
Citation
 Sidduri, ATilley, JWLou, JPChen, LKaplan, GMennona, FCampbell, RGuthrie, RHuang, TNRowan, KSchwinge, VRenzetti, LM N-Aroyl-L-phenylalanine derivatives as VCAM/VLA-4 antagonists. Bioorg Med Chem Lett 12:2479-82 (2002)  
Target
Name:
Integrin alpha-4/beta-1
Synonyms:
Fibronectin receptor beta/Integrin alpha-4 | Integrin alpha-4/beta-1
Type:
Mol. Mass.:
Description:
ASSAY_ID of EBI is 88912
Components:
This complex has 2 components.
Component 1
Name:
Integrin beta-1
Synonyms:
CD_antigen=CD29 Fibronectin receptor beta GPIIA ITGB1 MDF2 | MSK12
Type:
Enzyme
Mol. Mass.:
88400.38
Organism:
Homo sapiens (Human)
Description:
P05556
Residue:
798
  
Component 2
Name:
Integrin alpha-4
Synonyms:
CD49 antigen-like family member D CD49d antigen ITA4_HUMAN Integrin alpha-4 Integrin alpha-IV VLA-4 integrin alpha 4 precursor | integrin alpha-4 precursor
Type:
Membrane Protein
Mol. Mass.:
114897.35
Organism:
Homo sapiens (Human)
Description:
P13612
Residue:
1032
  
Inhibitor
Name:
BDBM50117047
Synonyms:
(S)-3-[4-(2,6-Dichloro-benzoylamino)-phenyl]-2-(2-fluoro-6-methyl-benzoylamino)-propionic acid | CHEMBL79441
Type:
Small organic molecule
Emp. Form.:
C24H19Cl2FN2O4
Mol. Mass.:
489.323
SMILES:
Cc1cccc(F)c1C(=O)N[C@@H](Cc1ccc(NC(=O)c2c(Cl)cccc2Cl)cc1)C(O)=O
: