Target
5-hydroxytryptamine receptor 2A
Ligand
BDBM50421589
Substrate
Meas. Tech.
ChEBML_2512
IC50
389±n/a nM
Citation
 Andrés, JIAlonso, JMFernández, JIturrino, LMartínez, PMeert, TFSipido, VK 2-(Dimethylaminomethyl)-tetrahydroisoxazolopyridobenzazepine derivatives. Synthesis of a new 5-HT(2C) antagonist with potential anxiolytic properties. Bioorg Med Chem Lett 12:3573-7 (2002)  
Target
Name:
5-hydroxytryptamine receptor 2A
Synonyms:
5-HT-2 5-HT2A 5-hydroxytryptamine receptor 2A (5HT-2A) 5HT2A_HUMAN HTR2A | Serotonin receptor 2A
Type:
undefined
Mol. Mass.:
52607.65
Organism:
Homo sapiens (Human)
Description:
P28223
Residue:
471
  
Inhibitor
Name:
BDBM50421589
Synonyms:
CHEMBL331077
Type:
Small organic molecule
Emp. Form.:
C18H21N3O
Mol. Mass.:
295.3788
SMILES:
CN(C)CC1CC2N(O1)c1cnccc1Cc1ccccc21
: