Target
Alpha-1D adrenergic receptor
Ligand
BDBM50000214
Substrate
Meas. Tech.
ChEMBL_32574 (CHEMBL643412)
EC50
794±n/a nM
Citation
 Bishop, MJBarvian, KABerman, JBigham, ECGarrison, DTGobel, MJHodson, SJIrving, PELiacos, JANavas, FSaussy, DLSpeake, JD alpha(1)-Adrenoceptor agonists: the identification of novel alpha(1A )subtype selective 2'-heteroaryl-2-(phenoxymethyl)imidazolines. Bioorg Med Chem Lett 12:471-5 (2002)  
Target
Name:
Alpha-1D adrenergic receptor
Synonyms:
ADA1D_HUMAN ADRA1D Adrenergic receptor alpha Alpha 1D-adrenoreceptor Alpha-1D adrenoceptor adrenergic Alpha1D
Type:
Enzyme Catalytic Domain
Mol. Mass.:
60485.82
Organism:
Homo sapiens (Human)
Description:
adrenergic Alpha1D ADRA1D HUMAN::P25100
Residue:
572
  
Inhibitor
Name:
BDBM50000214
Synonyms:
CHEMBL337862
Type:
Small organic molecule
Emp. Form.:
C16H17N3
Mol. Mass.:
251.3263
SMILES:
C(Nc1ccccc1-c1ccccc1)C1=NCCN1
: