Target
Alpha-1B adrenergic receptor
Ligand
BDBM50421597
Substrate
Meas. Tech.
ChEBML_34482
IC50
132±n/a nM
Citation
 Navas, FBishop, MJGarrison, DTHodson, SJSpeake, JDBigham, ECDrewry, DHSaussy, DLLiacos, JHIrving, PEGobel, MJ 2-(anilinomethyl)imidazolines as alpha1A adrenergic receptor agonists: 2'-heteroaryl and 2'-oxime ether series. Bioorg Med Chem Lett 12:575-9 (2002)  
Target
Name:
Alpha-1B adrenergic receptor
Synonyms:
ADA1B_HUMAN Adrenergic alpha1B Adrenergic receptor alpha Alpha 1B-adrenoreceptor | Alpha-1B adrenergic receptor
Type:
Enzyme
Mol. Mass.:
56862.13
Organism:
Homo sapiens (Human)
Description:
P35368
Residue:
520
  
Inhibitor
Name:
BDBM50421597
Synonyms:
CHEMBL155327
Type:
Small organic molecule
Emp. Form.:
C13H14N4O
Mol. Mass.:
242.2765
SMILES:
C(Nc1ccccc1-c1ccno1)C1=NCCN1
: