Target
Integrin alpha-4/beta-1
Ligand
BDBM50124116
Substrate
Meas. Tech.
ChEMBL_213380 (CHEMBL818163)
IC50
55±n/a nM
Citation
 Porter, JRArchibald, SCBrown, JAChilds, KCritchley, DHead, JCParton, TARobinson, MKShock, ATaylor, RJWarrellow, GJ Dehydrophenylalanine derivatives as VLA-4 integrin antagonists. Bioorg Med Chem Lett 13:805-8 (2003)  
Target
Name:
Integrin alpha-4/beta-1
Synonyms:
Fibronectin receptor beta/Integrin alpha-4 | Integrin alpha-4/beta-1
Type:
Mol. Mass.:
Description:
ASSAY_ID of EBI is 88912
Components:
This complex has 2 components.
Component 1
Name:
Integrin beta-1
Synonyms:
CD_antigen=CD29 Fibronectin receptor beta GPIIA ITGB1 MDF2 | MSK12
Type:
Enzyme
Mol. Mass.:
88400.38
Organism:
Homo sapiens (Human)
Description:
P05556
Residue:
798
  
Component 2
Name:
Integrin alpha-4
Synonyms:
CD49 antigen-like family member D CD49d antigen ITA4_HUMAN Integrin alpha-4 Integrin alpha-IV VLA-4 integrin alpha 4 precursor | integrin alpha-4 precursor
Type:
Membrane Protein
Mol. Mass.:
114897.35
Organism:
Homo sapiens (Human)
Description:
P13612
Residue:
1032
  
Inhibitor
Name:
BDBM50124116
Synonyms:
2-(2-Chloro-pyridin-3-yl)-8-[(3,5-dichloro-pyridine-4-carbonyl)-amino]-3H-benzo[d][1,3]diazepine-4-carboxylic acid | CHEMBL166656
Type:
Small organic molecule
Emp. Form.:
C21H12Cl3N5O3
Mol. Mass.:
488.711
SMILES:
OC(=O)C1=NC(=Nc2cc(NC(=O)c3c(Cl)cncc3Cl)ccc2C1)c1cccnc1Cl
: